- Tutorials

Microsoft.cppcommon.targets151 5 Error Msb6006 Cmd.exe Exited With Code 3

RECOMMENDED: If you have Windows errors then we strongly recommend that you download and run this (Windows) Repair Tool.

Cpp Common.targets(151,5): error MSB6006: "cmd.exe" exited with code 1. How to Build MariaDB 5.5 on Windows from Source Code:. system runtime library file does not exist: 'MSVC10_REDIST_DIR-NOTFOUND/x86/Microsoft. 3>CPack: Create package using ZIP 3>CPack: Install projects 3>CPack: – Install.

Microsoft.cppcommon.targets151 5 Error Msb6006 Cmd.exe Exited With Code 3. Languages , Windows Desktop Development > Visual C++ Question 0 Sign in to vote Hii Iam.

Point Cloud Library – Before reading your e-mail, we did ALL_BUILD and it didn’t take that long and only 3.5Gb but also 4 failed. (x86)MSBuildMicrosoft.Cppv4.0Microsoft.CppCommon.targets(151,5): error MSB6006: "cmd.exe" exited with.

CMake Error at radio/src/CMakeLists.txt:97 (message):. Installed git and cloned code. Error: — Found Threads: TRUE. 12>C:Program FilesMSBuildMicrosoft. CppCommon.targets(151,5): error MSB6006: "cmd.exe" exited with. 3>—— Build started: Project: taranis_fonts, Configuration: Release.

2015年6月5日. 1>C:Program Files (x86)MSBuildMicrosoft.Cppv4.0Microsoft.CppCommon. targets(151,5): error MSB6006: "cmd.exe" exited with code 1.

codere apuestas codem code org codecombat msb6006 codere codecademy codeína codema educamos org, codema, codeína, codecademy, apuestas, code, msb6006, codem, codere.

5): error MSB6006: "cmd.exe" exited with code 9009. [D:wireshark-2.0.0rc2build-win32docbookdeveloper_guide_docbook.vcxproj] 0 Warning(s) 3 Error(s) Any ideas how to fix this? Thanks Andy Ling.

exited with code 9009. 6_ CppCommon.targets(170,5): error MSB6006: "cmd.exe" exited with. Gacutil Exited with Code 9009;.

Error While Ejecting Cd Drive "Eject" Option Doesn't Work for ANY of My CD-ROM. "An error occured while ejecting [drive. Are these USB Optical drives? It may be confusing "Eject Device" with. The laptop appears to be dead. You plug the AC adapter but the LEDs (power light, hard drive light, battery charge light, etc…) do not light up and

Microsoft.cppcommon.targets Error Msb3491. as Fixed Fixed This item has been fixed in the current or upcoming version of this product. error msb3073 vcend exited with.

When it failed, the message would be a cryptic message: error MSB6006: "cmd.exe" exited with code 255. As the environment variable had to be picked up by every toolchain (Visual Studio Code, CMake, MSBuild, Visual Studio), it.

2014年1月9日. Cppv4.0Microsoft.CppCommon.targets(151,5): error MSB6006: "cmd.exe" exited with code 1. 1> 1>Build FAILED. 1> 1>Time Elapsed 00:00:.

CustomBuild: Performing Custom Build Tools Access is denied. 1>C:Program Files (x86)MSBuildMicrosoft.Cppv4.0Microsoft.CppCommon.targets(151,5): error MSB6006: "cmd.exe" exited with.

RECOMMENDED: Click here to fix Windows errors and improve system performance