- Tutorials

Error Project1 Exe Error

RECOMMENDED: If you have Windows errors then we strongly recommend that you download and run this (Windows) Repair Tool.

PROJECT1.EXE problems include high CPU usage, application errors, and possible virus infection. Here are the top five most common PROJECT1.EXE problems and how to fix.

Hi i’ve got a problem. I keep getting this awesome error "[Build Error] [Project1.exe] Error 1" I copied this source code from http://www.daniweb.com/forums/thread56924.html I just can’t seem to get it to work. can someone pls help.

But this code below is giving an error i've never experienced before. C: Program FilesBorlandCBuilder6ProjectsProject1.exe (error code 5).

Dev-C++ Compiler Error 1 – C++ Forum – Cplusplus.com – The only error message it gives is: make.exe *** [project2.exe] Error 1. All the other forum posts I can find about it there is more than one line of.

i try to test the well known ping.pas / icmp.pas, without any luck 🙁 I get the following error message: Exceptional class EAccessViolation with message Access violation at address 0045D810 in module ‘Project1.exe’. Read of address.

Even more » Account Options. Sign in; Search settings

So for some time now I keep having this problem: on windows 7 (64bit), with Delphi 7 and Delphi XE2, if from within the IDE, I compile a program, run it, stop it.

Ipod Cannot Be Restored Error What do all those error codes mean? – Apple iPod. – What do all those error codes mean? – Also look here for more info on error codes error -32768 svTempDisable: Temporarily disable card but run primary init. error. The new hard drive could not be restored in iTunes I bought and installed new ribbon

Should I remove Bible Library (Uninstall) by Ellis Enterprises? Learn how to remove Bible Library (Uninstall) from your computer.

What wrong with MAKEFILE.WIN on compiling the compiler gives a a single error *** Multiple target patterns. # Project: Project1 # Makefile created by Dev-C++ 4.9.9.8 CPP = g++.exe CC = gcc.exe WINDRES = windres.exe RES =.

If I create a new project in Visual Studio 2010 SP1 and select "WPF Application" and tries to build the generated application, I get the error The name.

May 5, 2012. mingw32binld.exe: cannot open output file Project1.exe: Permission. I removed generated exe file from projects folder and error went.

Apr 15, 2014. The next line of the error tells you, where that definition is: C:Usersvarun Desktopcprogmain.o main.c:(.text+0x0): first defined here.

Getting Invalid Platform error. Just installed 10.1. Last used Delphi v5 – Here’s the error. [Error Error] Invalid PLATFORM variable. c0w32w rtl.bpi vcl.bpi memmgr.lib sysinit.obj.Win32DebugProject1.obj.Win32DebugUnit1.obj ,Win32DebugProject1.exe ,Win32DebugProject1.map

Compiling 32- and 64-bit Windows binaries on Linux, cross-compiling, using gcc.

I have installed Dev-C++, but when I make a C program and run it, it gives me an error, like: C:\Users\Ved\Dev-Cpp\Makefile.win [Build Error] [Project1.exe] Error 1.

Jun 7, 2015. If you are getting the error that g++.exe has stopped working , you might be. g++ has-stopped-working-dev-c++-error-fixing. After messing around with the settings, it now says: [Build Error] exe: *** [Project1.exe] Error 1.

Project1.exe is not essential for Windows 10/8/7/XP and will often cause problems. Click here to see what Project1 is doing, and how to remove Project1.exe.

Jun 7, 2011. C:Dev-CppMY_ProjectMakefile.win [Build Error] [main.o] Error 1. find the path specified. make.exe: *** [main.o] Error 1 Execution terminated.

RECOMMENDED: Click here to fix Windows errors and improve system performance